instrument.owl
type: Ontology
contributor: Benedicte Batrancourt, Michel Dojat, Bernard Gibaud, Gilles Kassel, bernard.gibaud@univ-rennes1.fr
date: 2009-09-16
imports: study-examination-subject.owl

age-dependent-variable
type: Class
subclass of: instrument-variable
definition: An age dependent variable supports the registering of a standard score which is function of the subject’s age.

assessment-instrument
type: Class
subclass of: subject-data-acquisition-artefact
subclass of: proposition
subclass of: Restriction
  on property: has-for-model-acronym
  on class: model-acronym
  qualified cardinality: 1
subclass of: Restriction
  on property: is-referred-to-by
  some values from: instrument-definition-article
subclass of: Restriction
  on property: has-for-model-name
  on class: model-name
  qualified cardinality: 1
subclass of: Restriction
  on property: proper-part
  some values from: instrument-variable
subclass of: Restriction
  on property: explores
  on class: domain
  min qualified cardinality: 1
definition: Instrument (CDISC Clinical Research Glossary, v. 8.0): “A means to capture data (e.g., questionnaire, diary) plus all the information and documentation that support its use. NOTE: Generally, instruments include clearly defined methods and instructions for administration or responding, a standard format for data collection, and well-documented methods for scoring, analysis, and interpretation of results.” "Testing procedures are normally designed to be administered under carefully controlled or standardised conditions that embody systematic scoring protocols" (Source: ITC International Guidelines for Test Use, http://www.intestcom.org/Guidelines). ASSESSMENT INSTRUMENTS are divided among PSYCHOLOGICAL INSTRUMENTS, BEHAVIOURAL INSTRUMENTS, and NEUROCLINICAL INSTRUMENTS according to the kind of entity (a function or a behaviour) they explore. ASSESSMENT INSTRUMENTS are divided among QUESTIONNAIRES and TEST-INSTRUMENTS according to their mode of administration and whether they involve sets of questions, or require the performance of tasks or operations. ASSESSMENT INSTRUMENTS are divided among MONO-DOMAIN INSTRUMENTS and MULTI-DOMAINS INSTRUMENTS according to the number of DOMAINS they explore.

behavioural-instrument
type: Class
subclass of: assessment-instrument
disjoint with: neuroclinical-instrument
disjoint with: psychological-instrument
definition: A BEHAVIOURAL INSTRUMENT explores the subject's behavior and provides normative data and consistent measures about intensity/severity of a behavioral trait. In this context, the instrument does not measure the subject performance to realize a specific task and questionnaires are generally used. Each INSTRUMENT VARIABLE of the QUESTIONNAIRE is associated to a SCALE and each subject's answer corresponds to a SCALE ITEM. Generally, BEHAVIOURAL INSTRUMENTS are QUESTIONNAIRES. However, some exceptions exist especially when the explored domain is at the frontier between cognition and behavior (e.g. executive functions such as motivation, planning or social interaction). In these rare cases BEHAVIOURAL INSTRUMENTS are similar to TEST-INSTRUMENTS. “Standardised set of questions or stimuli which are administered to assess or measure the presence or absence of a particular skill, knowledge or behavior.” (Source: CSP/PT). (Concept: (CUI C0683444) behavioral test, Semantic Type: Diagnostic Procedure).

behavioural-interview
type: Class
subclass of: questionnaire-based-assessment
subclass of: Restriction
  on property: is-a-proper-part-of
  on class: behavioural-examination
  qualified cardinality: 1
subclass of: Restriction
  on property: has-for-instrument-at
  on class: behavioural-instrument
  qualified cardinality: 1
definition: A behavioural interview is a Questionnaire-based assessment carried out during a behavioral examination.

behavioural-test
type: Class
subclass of: test-based-assessment
subclass of: Restriction
  on property: has-for-instrument-at
  on class: behavioural-instrument
  qualified cardinality: 1
subclass of: Restriction
  on property: is-a-proper-part-of
  on class: behavioural-examination
  qualified cardinality: 1
disjoint with: neuroclinical-test
disjoint with: psychological-test

bi-coded-scale-item
type: Class
subclass of: qualitative-scale-item
subclass of: quantitative-scale-item
definition: A BI-CODED SCALE ITEM refers both to a qualitative value of the measured QUALITY associated to a quantitative value. Generally the behavior rating scales are built with a set of BI-CODED SCALE ITEM. The rater must decide whether the rating lies on the defined QUANTITATIVE SCALE ITEMS, which are associated with QUALITATIVE SCALE ITEMS. Example: The INSTRUMENT ‘Clinical Dementia Rating scale' explores the severity of dementia among the patients. The CODED VARIABLE of the INSTRUMENT ‘Clinical Dementia Rating scale' which measures the QUALITY 'Severity of dementia' has for scale a SCALE in whom, each BI-CODED ITEM SCALE refers both to a particular severity of the dementia by a quantitative way with the following QUANTITATIVE SCALE ITEMS (0, 0.5, 1, 2, 3) and to a particular severity of the dementia (meaning) by a qualitative way with the following QUALITATIVE SCALE ITEM ('No evidence of dementia', 'Questionable dementia', 'Mild dementia', 'Moderate dementia', 'Severe dementia').

coded-variable
type: Class
subclass of: instrument-variable
subclass of: Restriction
  on property: has-for-scale
  on class: scale
  qualified cardinality: 1
disjoint with: numerical-variable
definition: A CODED VARIABLE is an INSTRUMENT VARIABLE which is associated to a SCALE. The CODED VARIABLE measures a QUALITY whose values are coded by ITEMS of this SCALE. The CODED VARIABLE of the INSTRUMENT ‘Beck Depression Inventory’ which measures the QUALITY ‘Sadness’ has for scale the following 4-item SCALE: ('I do not feel sad', 'I feel sad much of the time', 'I am sad all the time', 'I am so sad or unhappy that I can't stand it').

coded-variable-assessment
type: Class
subclass of: variable-assessment
subclass of: Restriction
  on property: has-for-result-at
  on class: coded-score
  qualified cardinality: 1
subclass of: Restriction
  on property: has-for-data-at
  on class: coded-variable
  qualified cardinality: 1

composite-instrument
type: Class
equivalent class: Restriction
  on property: has-for-sub-instrument
  on class: assessment-instrument
  min qualified cardinality: 1
subclass of: assessment-instrument

corrected-score
type: Class
subclass of: numerical-score
subclass of: Restriction
  on property: is-derived-from
  on class: raw-score
  qualified cardinality: 1
disjoint with: raw-score
disjoint with: standardized-score
definition: The corrected score is the raw score corrected according to the cultural skill, and/or the age, and/or the sex of the subject. The correction is obtained from a table of normative data provided in the manual of the test-based assessment.

cultural-skill-dependent-variable
type: Class
subclass of: instrument-variable
definition: A cultural skill dependent variable supports the registering of a standard score which is function of the subject’s cultural skill.

experimental-psychology-test
type: Class
subclass of: psychological-test
subclass of: Restriction
  on property: is-a-proper-part-of
  on class: experimental-psychology-examination
  qualified cardinality: 1
subclass of: Restriction
  on property: has-for-instrument-at
  on class: experimental-psychology-instrument
  qualified cardinality: 1

instrument-based-assessment
type: Class
subclass of: subject-data-acquisition
subclass of: Restriction
  on property: is-a-proper-part-of
  on class: examination
  qualified cardinality: 1
subclass of: Restriction
  on property: has-for-instrument-at
  on class: assessment-instrument
  qualified cardinality: 1
subclass of: Restriction
  on property: has-for-proper-part
  on class: variable-assessment
  min qualified cardinality: 1
definition: An INSTRUMENT-BASED ASSESSMENT is a SUBJECT DATA ACQUISITION that captures some required information concerning the subject and involves the integration of data from instruments: TEST(-INSTRUMENTS) and/or QUESTIONNAIRES. When the purpose of the patient's examination is the assessment of her/his behavior, the examiner uses questionnaires rather than tests to rate the level of intensity/severity of a behavioral trait. Then, the appropriate action is a BEHAVIOURAL INTERVIEW rather than a BEHAVIOURAL TEST which is less adapted. INSTRUMENT-BASED ASSESSMENTS are divided among TEST-BASED ASSESSMENTS and QUESTIONNAIRE-BASED ASSESSMENTS according to the kind of instrument which is administrated and therefore to the specific roles played by the subject and the healthcare professional in the assessment.

instrument-variable
type: Class
subclass of: subject-data-acquisition-artefact
subclass of: proposition
subclass of: Restriction
  on property: has-for-model-acronym
  some values from: model-acronym
subclass of: Restriction
  on property: explores
  on class: domain
  qualified cardinality: 1
subclass of: Restriction
  on property: is-a-variable-of
  on class: assessment-instrument
  qualified cardinality: 1
subclass of: Restriction
  on property: measures
  on class: quality
  qualified cardinality: 1
definition: An Instrument variable is the part of an instrument that refers to the precise measurement of a specific quality of a subject’s capacity (function) or a subject’s trait (in a qualitative or quantitative way). Instrument variables specify how the registering of scores must be done, by characterizing the type of values of the scores. Several instrument variables may be necessary to characterize the subject’s function or trait explored by the instrument. INSTRUMENT VARIABLES are divided among MAIN and SECONDARY VARIABLES according to whether they explore the same domain than the ASSESSMENT INSTRUMENT. INSTRUMENT VARIABLES are divided among NUMERICAL and CODED VARIABLES according to the way the score they register is coded (i.e. by a NUMBER, a SCALAR QUALE or a SCALE ITEM).

main-variable
type: Class
subclass of: instrument-variable
disjoint with: secondary-variable
definition: A main variable explores the same cognitive function or trait of the subject than the instrument.

mono-domain-instrument
type: Class
subclass of: assessment-instrument
subclass of: Restriction
  on property: explores
  on class: domain
  qualified cardinality: 1
disjoint with: multi-domains-instrument

neuroclinical-instrument
type: Class
subclass of: assessment-instrument
disjoint with: psychological-instrument
definition: NEUROCLINICAL INSTRUMENTS are used in neurology, to precisely quantify symptoms and related patient disability. A neuroclinical instrument provides normative data, consistent measures about "the strength, efficiency, reactivity, and appropriateness of the patient's responses to commands, questions, discrete stimulation of particular neural subsystems" (Lezak et al., 2004).

neuroclinical-interview
type: Class
subclass of: questionnaire-based-assessment
subclass of: Restriction
  on property: has-for-instrument-at
  on class: neuroclinical-instrument
  qualified cardinality: 1
subclass of: Restriction
  on property: is-a-proper-part-of
  on class: neuro-clinical-examination
  qualified cardinality: 1
definition: A neuroclinical interview is a Questionnaire-based assessment carried out during a neurological examination.

neuroclinical-test
type: Class
subclass of: test-based-assessment
subclass of: Restriction
  on property: is-a-proper-part-of
  on class: neuro-clinical-examination
  qualified cardinality: 1
subclass of: Restriction
  on property: has-for-instrument-at
  on class: neuroclinical-instrument
  qualified cardinality: 1
disjoint with: psychological-test
definition: “The Neuroclinical examination (Neurological test) is the usual clinical approach to the study of the brain functions. The Neurological test includes extensive study of the brain's chief product-behavior. [...] The neurologist examines the strength, efficiency, reactivity, and appropriateness of the patient's responses to commands, questions, discrete stimulation of particular neural subsystems, and challenges to specific muscle groups and motor patterns. […] In the neurological examination of behavior, the clinician reviews behavior patterns generated by neuroanatomical subsystems, measuring patients' responses in relatively coarse graduations or nothing their absence" (Lezak et al., 2004).

neuropsychological-instrument
type: Class
subclass of: psychological-instrument
definition: NEUROPSYCHOLOGICAL INSTRUMENTS are used as tools in NEUROPSYCHOLOGICAL EXAMINATIONS to measure a psychological function known to be linked to a particular brain structure or pathway. “Neuropsychological tests are specifically designed tasks used to measure a psychological function known to be linked to a particular brain structure or pathway. They usually involve the systematic administration of clearly defined procedures in a formal environment. Neuropsychological tests are typically administered to a single person working with an examiner in a quiet office environment, free from distractions. As such, it can be argued that neuropsychological tests at times offer an estimate of a person's peak level of cognitive performance. Neuropsychological tests are a core component of the process of conducting neuropsychological assessment” (Source: http://en.wikipedia.org). “Tests designed to assess neurological function associated with certain behaviors; used in diagnosing brain dysfunction or damage and central nervous system disorders or injury.” (Source: CSP/PT). (Concept: (CUI C0027902) Neuropsychological Tests, Semantic Type: Diagnostic Procedure).

neuropsychological-test
type: Class
subclass of: psychological-test
subclass of: Restriction
  on property: has-for-instrument-at
  on class: neuropsychological-instrument
  qualified cardinality: 1
subclass of: Restriction
  on property: is-a-proper-part-of
  on class: neuro-psychological-examination
  qualified cardinality: 1
definition: "Neuropsychological assessment is a method of examining the brain by studying its behavioural product. Since the subject matter of neuropsychological assessment is behavior, it relies on many of the same techniques, assumptions, and theories as does psychological assessment. The distinctive character of neuropsychological assessment lies in a conceptual frame of reference that takes brain function as its point of departure. Regardless of whether a behavioral study is undertaken for clinical or research purposes, it is neuropsychological so long as the questions that prompted it, the central issues, the findings, or the inferences drawn from them ultimately relate to brain function" (Lezak et al., 2004).

numerical-variable
type: Class
subclass of: instrument-variable
definition: A NUMERICAL VARIABLE is an INSTRUMENT VARIABLE which measures a QUALITY which has for quales (during a TIME INTERVAL) NUMBERS or SCALAR QUALES (a NUMBER + a UNIT OF MEASURE). Example 1: The NUMERICAL VARIABLE ‘FCSRT-IR-3-1v3' of the INSTRUMENT ‘Free and Cued Selective Reminding Test with Immediate Recall 16-item-version-(FCSRT-IR)’ measures the QUALITY ‘Total number of words correctly retrieved on the three successive trials’ which has for quales NUMBERS. This NUMERICAL VARIABLE has for minimum numerical value 0 and has for maximum numerical value 48. Example 2: The NUMERICAL VARIABLE of the INSTRUMENT ‘Rey-Osterrieth-Complex-Figure-Test-(CFT)-Copy-administration’ measures the QUALITY ‘length of time needed by the subject to copy the figure’ which has for quales SCALAR QUALES. The test is not timed, but the length of time needed to copy the figure is observed, and the average time is about 180 seconds. This NUMERICAL VARIABLE has for minimum scalar value 0 second and has for maximum scalar value a SCALAR QUALE chosen by the examinator beyond 300 seconds.

numerical-variable-assessment
type: Class
subclass of: variable-assessment
subclass of: Restriction
  on property: has-for-result-at
  on class: raw-score
  qualified cardinality: 1
subclass of: Restriction
  on property: has-for-data-at
  on class: numerical-variable
  qualified cardinality: 1

psychological-instrument
type: Class
subclass of: assessment-instrument
definition: PSYCHOLOGICAL INSTRUMENTS are divided among NEUROPSYCHOLOGICAL INSTRUMENTS and EXPERIMENTAL PSYCHOLOGY INSTRUMENTS according to the kind of DOMAINS they explore. A psychological instrument provides normative data, consistent measures about intensity/severity of a psychological and/or psychopathological trait. “Standardized tests designed to measure abilities, as in intelligence, aptitude, and achievement tests, or to evaluate personality traits”. (Source: MSH/MH). (Concept: (CUI C0033905) Psychological Tests (procedure), Semantic Type: Diagnostic Procedure).

psychological-interview
type: Class
subclass of: questionnaire-based-assessment
subclass of: Restriction
  on property: has-for-instrument-at
  on class: psychological-instrument
  qualified cardinality: 1
subclass of: Restriction
  on property: is-a-proper-part-of
  on class: psychological-examination
  qualified cardinality: 1
definition: A psychological interview is a Questionnaire-based assessment carried out during a psychological examination.

psychological-test
type: Class
subclass of: test-based-assessment
subclass of: Restriction
  on property: is-a-proper-part-of
  on class: psychological-examination
  qualified cardinality: 1
subclass of: Restriction
  on property: has-for-instrument-at
  on class: psychological-instrument
  qualified cardinality: 1
definition: "[…] psychological assessment […] involves the intensive study of behavior by means of interviews and standardized scaled tests and questionnaires that provide relatively precise and sensitive indices of behaviour." (Lezak et al., 2004). PSYCHOLOGICAL TESTS are divided among NEUROPSYCHOLOGICAL TESTS and EXPERIMENTAL PSYCHOLOGY TESTS according to the kind of instrument that is used.

psychophysical-test
type: Class
subclass of: experimental-psychology-test
subclass of: Restriction
  on property: is-a-proper-part-of
  on class: psychophysical-examination
  qualified cardinality: 1
subclass of: Restriction
  on property: has-for-instrument-at
  on class: psychophysical-instrument
  qualified cardinality: 1

qualitative-scale-item
type: Class
subclass of: scale-item
subclass of: Restriction
  on property: has-qualitative-scale-item-code
  qualified cardinality: 1
  on data range: string
definition: A QUALITATIVE SCALE ITEM refers to a qualitative value of the measured QUALITY. Each QUALITATIVE SCALE ITEM from the SCALE is designed to report a qualitative attribute about the cognitive ability or the psychological trait or the behavior and therefore to reflect the pathological level/intensity/severity of the behavior or the disability by a qualitative way. Example: The INSTRUMENT ‘Beck Depression Inventory' can distinguish between different subtypes of depressive disorders, such as major depression and dysthymia (a less severe form of depression). The CODED VARIABLE of the INSTRUMENT ‘Beck Depression Inventory' which measures the QUALITY 'Intensity of depression' has for scale a SCALE in whom, each QUALITATIVE ITEM SCALE refers to a particular intensity of the depression by a qualitative way ('minimal depressive symptoms', 'mild depression', 'moderate depression, 'severe depression').

quantitative-scale-item
type: Class
subclass of: scale-item
subclass of: Restriction
  on property: has-quantitative-scale-item-code
  qualified cardinality: 1
  on data range: string
subclass of: Restriction
  on property: is-an-equivalent-quale-as
  on class: number
  qualified cardinality: 1
subclass of: Restriction
  on property: has-numerical-value
  some values from: float
definition: A QUANTITATIVE SCALE ITEM refers to a quantitative value of the measured quality. Each QUANTITATIVE SCALE ITEM from the SCALE is designed to report a quantitative attribute about the cognitive ability or the psychological trait or the behavior and therefore to reflect the pathological level/intensity of the behavior or the disability by a quantitative way. Example: The INSTRUMENT 'Montgomery-Asberg Depression Rating Scale' (MADRS) is a diagnostic questionnaire which psychiatrists use to measure the severity of depressive episodes in patients with mood disorders. For each CODED VARIABLE, associated to a SCALE, the rater must decide whether the rating lies on the defined QUANTITATIVE SCALE ITEMS (0, 1, 2, 3, 4, 5, 6).

questionnaire
type: Class
subclass of: assessment-instrument
disjoint with: test-instrument
definition: Questionnaire (CDISC Clinical Research Glossary, v. 6.0): A set of questions or items shown to a respondent in order to get answers for research purposes.

questionnaire-based-assessment
type: Class
subclass of: instrument-based-assessment
subclass of: Restriction
  on property: has-for-instrument-at
  on class: questionnaire
  qualified cardinality: 1
definition: A Questionnaire-based assessment is an Instrument-based assessment which involves the integration of data from questionnaires. A questionnaire-based assessment involves sets of questions (items), carried out in a structured way (known as structured interview) or semi-structured way, to provide normative data. Interview-based measures and rating scales are designed to be completed by clinicians, subjects, parents, caregivers. The scoring of each item contributes to the measure of the explored domain (e.g. Depression). “A directed conversation with the subject aimed at eliciting information for psychiatric diagnosis, evaluation, treatment planning, etc. The interview may be conducted by a social worker or psychologist.” (Source: MSH/MH). (Concept: [CUI C0021819] Interview, Psychological, Semantic Type: Diagnostic Procedure). QUESTIONNAIRE-BASED ASSESSMENTS are divided among PSYCHOLOGICAL INTERVIEWS, BEHAVIOURAL INTERVIEWS, and NEUROCLINICAL INTERVIEWS according to the kind of questionnaire that is used.

raw-score
type: Class
subclass of: numerical-score
disjoint with: standardized-score
definition: (M.D. Lezak et al., 2004): “The raw score is the simple sum of correct answers or correct answers minus a portion of the incorrect ones. For in itself a raw score communicates nothing about its relative value”

scale
type: Class
subclass of: region
subclass of: Restriction
  on property: is-the-scale-of
  on class: coded-variable
  qualified cardinality: 1
definition: “A rating scale is a set of categories designed to elicit information about a quantitative or a qualitative attribute in the social sciences” (Source: http://en.wikipedia.org). “Scales can focus on different aspects of mood, behavior, and functional abilities”. (Source: Lezak et al., 2004). “The "levels of measurement", or scales of measure are expressions that typically refer to the theory of scale types developed by the psychologist Stanley Smith Stevens. Stevens proposed his theory in a 1946 Science article titled "On the theory of scales of measurement". In that article, Stevens claimed that all measurement in science was conducted using four different types of scales that he called "nominal", "ordinal", "interval" and "ratio". … As a matter of fact, most of the scales used widely and effectively by psychologists are ordinal scales. … Psychometricians like to theorise that psychometric tests produce interval scale measures of cognitive abilities (e.g. Lord & Novick, 1968; von Eye, 2005) but there is little prima facie evidence to suggest that such attributes are anything more than ordinal for most psychological data (Cliff, 1996; Cliff & Keats, 2003; Michell, 2008). … There has been, and continues to be, debate about the merits of the classifications, particularly in the cases of the nominal and ordinal classifications (Michell, 1986). Thus, while Stevens' classification is widely adopted, it is by no means universally accepted. … The theory of scale types is the intellectual handmaiden to Stevens' "operational theory of measurement", which was to become definitive within psychology and the behavioral sciences, despite Michell's characterization as its being quite at odds with Michell's understanding of measurement in the natural sciences (Michell, 1999). Essentially, the operational theory of measurement was a reaction to the conclusions of a committee established in 1932 by the British Association for the Advancement of Science to investigate the possibility o…

scale-item
type: Class
subclass of: quale
subclass of: Restriction
  on property: is-an-atomic-part-of
  on class: scale
  qualified cardinality: 1
definition: During an observation, the process of approximating the observed QUALITY’s value (called QUALE in DOLCE) turns the continuous QUALE of the observed quality into a discrete approximation entity which is a SCALE ITEM. While the construction of the SCALE, a set of QUALITY's values are chosen and each of them is coded by a SCALE ITEM. Generally, a SCALE consists of 4 SCALE ITEMS (short version) or of 6 SCALE ITEMS (long version). Example: In the INSTRUMENT ‘Beck Depression Inventory', the SCALE ITEM 'I feel sad much of the time' belongs to the SCALE which is the scale of the CODED VARIABLE which measures the QUALITY ‘Sadness’. This SCALE ITEM refers to a specific level of sadness.

score
type: Class
subclass of: result
subclass of: Restriction
  on property: is-a-result-of-at
  on class: variable-assessment
  qualified cardinality: 1
definition: SCORES are divided into CODED SCORES AND NUMERICAL SCORES according to whether they are coded by a LEXICAL ITEM or a NUMBER.

secondary-variable
type: Class
subclass of: instrument-variable
definition: A secondary variable provides some additional information about a cognitive function or a trait of the subject.

sex-dependent-variable
type: Class
subclass of: instrument-variable
definition: A sex dependent variable supports the registering of a standard score which is function of the subject’s sex.

standardized-score
type: Class
subclass of: numerical-score
subclass of: Restriction
  on property: is-referred-to-by
  on class: score-standardization-article
  min qualified cardinality: 1
subclass of: Restriction
  on property: is-derived-from
  on class: raw-score
  qualified cardinality: 1
definition: “To make the comparisons necessary for evaluating impairment, test-makers generally reports scores as values of a scale based on the raw scores made by a standardization population (the group of individual tested for the purpose of obtaining normative data on the test). The scale that is most meaningful statistically is one derived from the normal probability curved and based on the standard deviation unit. There are a variety of standard scores that are all translations of the same scale, based on the mean and the standard deviation. [...] The z-score is the basic, unelaborated standard score from which all others can be derived. The z-score represents, in standard deviation units, the amount a score deviates from the mean of the population from which the score is drawn. The mean of the normal curve is set at zero and the standard deviation unit has a value of one. Scores are stated in term of their distance from the mean as measured in standard deviation units. Scores above the mean have a positive value; those below the mean are negative. Neuropsychological test data can be handled very appropriately in a z-score format. Elaborations of the z-score are called derived scores. Among the most widely used derived scores are T-scores, which are very popular in educational testing. The T-score has a mean of 50 and a standard deviation of 10.” (Lezak et al., 2004)

sub-instrument
type: Class
subclass of: assessment-instrument
subclass of: Restriction
  on property: is-a-sub-instrument-of
  on class: assessment-instrument
  qualified cardinality: 1

subject-data-acquisition
type: Class
subclass of: conceptual-action
subclass of: Restriction
  on property: affects-at
  on class: subject
  qualified cardinality: 1
subclass of: Restriction
  on property: has-for-agent-at
  some values from: human
definition: A Subject data acquisition is an action which is conducted to capture some required information (data pertaining to the status of a subject under investigation) along with study conditions.

test-based-assessment
type: Class
subclass of: instrument-based-assessment
subclass of: Restriction
  on property: has-for-instrument-at
  on class: test-instrument
  qualified cardinality: 1
definition: A Test-based assessment is an Instrument-based assessment which involves the integration of data from tests. A Test-based assessment is conducted as a formal testing session to provide normative data. TEST-BASED ASSESSMENTS are divided among PSYCHOLOGICAL TESTS, BEHAVIOURAL TESTS and NEUROCLINICAL TESTS according to the kind of instrument that is used.

test-instrument
type: Class
subclass of: assessment-instrument
definition: A test-instrument is an instrument that solicits an authentic production from the subject, e.g., a reflex, a performance (such as a drawing, or a 500-meter walk). This production is recorded under control of a healthcare professional, but remains objective.

variable-assessment
type: Class
subclass of: subject-data-acquisition
subclass of: Restriction
  on property: is-a-proper-part-of
  on class: instrument-based-assessment
  qualified cardinality: 1
subclass of: Restriction
  on property: has-for-data-at
  on class: instrument-variable
  qualified cardinality: 1
subclass of: Restriction
  on property: has-for-result-at
  on class: score
  min qualified cardinality: 1